{"text_format":"1","workbook":"xlsx","n_sheets":3,"sheets":["VMware FINAL ORDER SUMMARY","Product & Price List","Click to Quote"],"not_rendered":{"charts":0,"images":4,"macros":1,"external_links":1,"defined_names":2,"comments":1,"pivot_tables":0},"unopened":[],"bounds":{"document_bytes":16777216,"sheet_cells":100000,"rows_first":2000,"rows_last":500,"rows_between":2000,"halvings":0,"cell_chars":16384,"cell_head_chars":4096},"cells_cut":0,"cells_raw":0,"read":"whole","date_system":"1900"}

{"sheet":"VMware FINAL ORDER SUMMARY","index":0,"n_rows":194,"n_cols":19,"rows_kept":194,"cut":false,"hidden":false,"merged":[[99,7,99,8],[95,5,95,6],[96,5,96,6],[93,5,93,6],[94,5,94,6],[98,15,98,17],[99,15,99,17],[91,5,91,6],[98,5,98,6],[95,7,95,8],[95,15,95,17],[96,7,96,8],[96,15,96,17],[92,15,92,17],[93,7,93,8],[93,15,93,17],[94,7,94,8],[92,5,92,6],[92,7,92,8],[94,15,94,17],[97,5,97,6],[97,7,97,8],[97,15,97,17],[90,5,90,6],[98,7,98,8],[90,7,90,8],[73,9,73,11],[81,5,81,6],[73,5,73,8],[80,15,80,17],[75,5,75,6],[75,7,75,8],[75,15,75,17],[76,15,76,17],[76,7,76,8],[77,7,77,8],[84,7,84,8],[88,5,88,8],[77,15,77,17],[76,5,76,6],[77,5,77,6],[79,5,79,6],[83,7,83,8],[88,9,88,11],[79,15,79,17],[78,7,78,8],[89,5,89,6],[74,7,74,8],[78,15,78,17],[38,6,39,18],[41,6,41,9],[42,12,42,18],[42,6,42,9],[43,6,43,9],[44,6,44,9],[45,6,45,9],[74,5,74,6],[43,12,43,18],[68,6,68,13],[72,5,72,17],[74,15,74,17],[49,5,49,18],[146,6,146,7],[146,8,146,14],[147,6,147,7],[147,8,147,14],[0,6,0,17],[3,5,3,18],[83,15,83,17],[84,15,84,17],[83,5,83,6],[84,5,84,6],[78,5,78,6],[114,5,114,13],[125,5,125,6],[41,12,41,18],[119,5,119,6],[119,12,119,13],[121,5,121,6],[121,12,121,13],[119,7,119,8],[88,12,88,17],[73,12,73,17],[120,5,120,6],[44,12,44,18],[45,12,45,18],[125,12,125,13],[125,7,125,8],[121,15,127,18],[126,12,127,13],[126,11,127,11],[121,7,121,8],[122,5,122,6],[123,5,123,6],[124,5,124,6],[104,10,105,10],[100,15,100,17],[91,7,91,8],[117,12,117,13],[117,5,117,6],[115,7,115,8],[116,7,116,8],[115,5,115,6],[106,7,106,8],[116,5,116,6],[117,15,120,18],[120,7,120,8],[118,12,118,13],[120,12,120,13],[118,7,118,8],[118,5,118,6],[115,12,115,13],[115,15,116,18],[116,12,116,13],[111,6,111,8],[106,5,106,6],[117,7,117,8],[91,15,91,17],[99,5,99,6],[156,7,156,14],[157,7,157,14],[158,7,158,14],[149,8,149,9],[151,7,151,14],[136,7,136,14],[80,7,80,8],[79,7,79,8],[81,15,81,17],[85,5,85,14],[81,7,81,8],[82,5,82,6],[80,5,80,6],[82,15,82,17],[90,15,90,17],[104,7,105,8],[89,7,89,8],[104,11,105,11],[82,7,82,8],[104,9,105,9],[89,15,89,17],[85,15,85,17],[104,5,105,6],[100,5,100,14],[174,6,175,8],[133,6,133,16],[122,7,122,8],[122,12,122,13],[123,7,123,8],[123,12,123,13],[124,7,124,8],[124,12,124,13],[148,6,148,7],[148,8,148,14],[141,7,141,14],[142,7,142,14],[144,6,144,12],[170,7,170,9],[173,6,173,16],[160,7,160,14],[161,7,161,14],[162,7,162,14],[167,7,167,14],[168,7,168,14],[169,7,169,9],[152,7,152,14],[153,7,153,14],[154,7,154,14]]}
[null,"NEW","UPGRADE","RENEWAL",null,"Version 27"]
[]
[]
[null,null,null,null,null,"OARnet/ VMware - VIRTUALIZATION PROGRAM ORDER FORM"]
[]
[]
[]
[]
[]
[]
[]
[]
[]
[]
[]
[]
[]
[]
[null,"AIRWATCH","••••••••••••  AIRWATCH •••••••••••• ","AIRWATCH"]
[null,"• AirWatch by VMware Secure Content Locker Collaborate",null,"• AirWatch by VMware Secure Content Locker Collaborate"]
[null,"• AirWatch by VMware Mgt Suite for Laptops","AIRWATCH SERCURE CONTENT LOCKER COLLABORATE","• AirWatch by VMware Management Suite for Laptops"]
[null,"• AirWatch by VMware Mgt Suite for Rugged Devices","• Upgrade: AirWatchSecContentLockView to S.C.L. Collaborate","• AirWatch by VMware Management Suite for Rugged Devices"]
[null,"• AirWatch by VMware Green Mgt Suite",null,"• AirWatch by VMware Green Management Suite"]
[null,"• AirWatch by VMware Orange Mgt Suite","AIRWATCH ORANGE MGMT SUITE","• AirWatch by VMware Orange Management Suite"]
[null,"• AirWatch by VMware Blue Mgt Suite Perpetual, One Time Fee / Device","• Upgrade: AirWatch Green Mgmt Suite to Orange Mgmt Suite","• AirWatch by VMware Blue Management Suite"]
[null,"• AirWatch by VMware Yellow Mgt Suite - Perpetual, One Time Fee / Device",null,"• AirWatch by VMware Yellow Management Suite"]
[null,null,"AIRWATCH BLUE MGMT SUITE"]
[null,"APP VOLUME","• Upgrade: AirWatch Green Mgt STE to Blue Mgt STE - Perpetual, 1XFee/Device","APP VOLUME"]
[null,"• App Volumes 10 Pack (CCU)","• Upgrade: AirWatch Orange Mgt STE to Blue Mgt STE - Perpetual, 1XFee/Device","• App Volumes 10 Pack (CCU)"]
[null,"• App Volumes 100 Pack (CCU)",null,"• App Volumes 100 Pack (CCU)"]
[null,null,"AIRWATCH YELLOW MGMT SUITE"]
[null,"CONTINUENT","• Upgrade: AirWatchMobileDev&ContentLockerView to Yellow Mgt STE - Perpl, 1X Fee/Dev  ***Upgrade from Mobile Device Mgt & AirWatch Content Locker View to Yellow Mgt Suite - Perpetual, One Time Fee / Device","CONTINUENT"]
[null,"• Continuent for Analytics & Big Data - Per Cluster License","• Upgrade:  AirWatch Green Mgt STE to Yellow Mgt STE - Perpetual, 1XFee/Device","• Continuent for Analytics & Big Data - Per Cluster License"]
[null,"• Continuent for Clustering - Per Database Server License","• Upgrade: AirWatch Orange Mgt STE to Yellow Mgt STE - Perpetual, 1X ee/Device","• Continuent for Clustering - Per Database Server License"]
[null,"• Continuent for Disaster Recovery - Per Database Server License","• Upgrade: AirWatch Blue Mgt STE to Yellow Mgt STE - Perpetual, 1XFee/Device","• Continuent for Disaster Recovery - Per Database Server License"]
[null,"• Continuent for Replication - Per Database Server License",null,"• Continuent for Replication - Per Database Server License"]
[]
[null,"• Horizon View Standard Edition (100 pack) (CCU)","FUSION","• Horizon Workspace Portal: 100 pack"]
[null,"• Horizon Workspace Portal: 10 pack","• Upgrade: Fusion to Fusion Professional Edition, ESD",null,null,null,"IN WITNESS WHEREOF, each party hereto warrants and represents that this Order Form has been executed by a duly authorized representative of such party, and it constitutes the legal, valid and binding obligation of such party."]
[null,"• Horizon Workspace Portal: 100 pack",null,"IT BUSINESS/FINANCIAL MANAGEMENT"]
{"$rows_left_out":155}
{"sheet":"Product & Price List","index":1,"n_rows":581,"n_cols":12,"rows_kept":581,"cut":false,"hidden":false,"merged":[[177,3,177,7],[15,3,15,7],[398,3,398,5],[1,6,1,7],[2,6,2,7],[3,6,3,7],[5,6,5,7],[7,6,7,7],[9,6,9,7],[10,6,10,7],[11,6,11,7],[12,6,12,7]]}
[]
[null,null,null,"NEW PRODUCTS","Airwatch","ITBM","ThinApp",null,null,"vRealize","vSphere (Other)"]
[null,null,null,"GO TO (Product Name/Family):","APP Volume","Mirage","User Evironment Mgr",null,null,"vRealize Log Insight","Workspace Suite"]
[null,null,null,null,"Continuent","NSX / Nicira","vCenter ",null,null,"vSAN / Storage","Workstation"]
[null,null,null,null,"Fusion","Pivotal","vCloud",null,null,"vSphere "]
[null,null,null,null,"Horizon","Player","vFabric",null,null,"vSphere Kits"]
[]
[null,null,null,"UPGRADE PRODUCTS","Airwatch","NSX/NICIRA","vRealize",null,null,"MAINTENANCE RENEWAL",null,"   NOTES:"]
[null,null,null,null,"APP Volume","Pivotal","vSAN/Storage",null,null,"GO TO RENEWALS"]
[null,null,null,"GO TO (Product Name/Family):","Continuent","Player","vSphere",null,null,"(Existing OARnet licenses ONLY.)",null,"   All product support under this contract is at the VMware Production Level."]
[null,null,null,null,"Fusion","User Environment Mgr","Workstation",null,null,null,null,"   All products require the license and maintenance to be purchased from OARnet."]
[null,null,null,null,"Horizon","vCenter"]
[null,null,null,null,"ITBM","vCloud"]
[]
[]
[null,null,null,"New VMware Products & Pricing (and Maintenance)"]
[null,null,null,"Product","Product Code","SnS Code","License Fee","1 yr SnS Fee"]
[]
[null,null,null,"AIRWATCH"]
[null,null,null,"• AirWatch by VMware Secure Content Locker Collaborate","V-MCC-PL-ANY-DEV-C","V-MCC-MF-ANY-DEV-C",18.5,6.5,null,"NOTE:  Minimum initial purchase quantity of 25."]
[null,null,null,"• AirWatch by VMware Mgt Suite for Laptops","V-MS-PL-DEV-LT-C","V-MS-MF-DEV-LT-C",18.5,6.5,null,"NOTE:  Minimum initial purchase quantity of 25."]
[null,null,null,"• AirWatch by VMware Mgt Suite for Rugged Devices","V-MS-PL-DEV-RG-C","V-MS-MF-DEV-RG-C",18.5,6.5,null,"NOTE:  Minimum initial purchase quantity of 25."]
[null,null,null,"• AirWatch by VMware Green Mgt Suite","V-GMS-PL-DEV-C","V-GMS-MF-DEV-C",18.5,6.5,null,"NOTE:  Minimum initial purchase quantity of 25."]
[null,null,null,"• AirWatch by VMware Orange Mgt Suite","V-OMS-PL-DEV-C","V-OMS-MF-DEV-C",25.9,8.4499999999999993,null,"NOTE:  Minimum initial purchase quantity of 25."]
[null,null,null,"• AirWatch by VMware Blue Mgt Suite Perpetual, One Time Fee / Device","V-BMS-PL-DV2-C"," BMS15-PL-DEV",33.299999999999997,11.05,null,"NOTE:  Minimum initial purchase quantity of 25."]
[null,null,null,"• AirWatch by VMware Yellow Mgt Suite - Perpetual, One Time Fee / Device","V-YMS-PL-DV2-C","YMS15-PL-DEV",48.1,16.25,null,"NOTE:  Minimum initial purchase quantity of 25."]
[]
[null,null,null,"APP VOLUME"]
[null,"NEW",null,"• App Volumes 10 Pack (CCU)","CV-CCU-10-C","CV-CCU-10-P-SSS-C",555,185.25]
[null,"NEW",null,"• App Volumes 100 Pack (CCU)","CV-CCU-100-C","CV-CCU-100-P-SSS-C",5550,1852.5]
[]
[null,null,null,"CONTINUENT"]
[null,"NEW",null,"• Continuent for Analytics & Big Data - Per Cluster License","CN-ABD-C","CN-ABD-P-SSS-C",33300,11115]
[null,"NEW",null,"• Continuent for Clustering - Per Database Server License","CN-CP-C","CN-CP-P-SSS-C",11100,3705]
[null,"NEW",null,"• Continuent for Disaster Recovery - Per Database Server License","CN-DR-C","CN-DR-P-SSS-C",5550,1852.5]
[null,"NEW",null,"• Continuent for Replication - Per Database Server License","CN-RP-C","CN-RP-P-SSS-C",11100,3705]
[]
[null,null,null,"FUSION"]
[null,null,null,"• Fusion Professional Edition, ESD  (SnS is optional)","FUS7-PRO-C","FUS-PRO-P-SSS-C",48.1,16.25]
[]
{"$rows_left_out":542}
{"sheet":"Click to Quote","index":2,"n_rows":69,"n_cols":11,"rows_kept":69,"cut":false,"hidden":false,"merged":[[26,0,26,1],[20,0,20,2],[20,3,20,5],[20,6,20,9],[34,0,34,2],[34,3,34,5],[34,6,34,9],[27,0,27,1],[28,0,28,1],[29,0,29,1],[30,0,30,1],[31,0,31,1],[12,0,12,10],[22,0,22,1],[23,0,23,1],[24,0,24,1],[25,0,25,1],[21,0,21,1],[53,0,53,1],[42,0,42,1],[43,0,43,1],[45,0,45,1],[48,0,48,1],[49,0,49,1],[50,0,50,1],[41,0,41,1],[35,0,35,1],[60,0,60,1],[61,0,61,1],[57,0,57,1],[54,0,54,1],[55,0,55,1],[56,0,56,1],[36,0,36,1],[37,0,37,1],[38,0,38,1],[39,0,39,1],[40,0,40,1],[44,0,44,1],[51,0,51,1],[52,0,52,1]]}
[]
[]
[]
[]
[]
[]
[]
[]
[]
[]
[]
[]
["VMware Price Quote"]
[]
["Quote #:",{"$f":"CONCATENATE(\"OAR\",ROUND(NOW(),2),ROUND((RAND()*10000),0))","v":"OAR42205.445514"},null,null,null,null,null,null,null,"Date:",{"$f":"TODAY()","v":"2015-07-20"}]
[]
["Customer Name:",{"$f":"IF('VMware FINAL ORDER SUMMARY'!$H$51=FALSE,\"\",'VMware FINAL ORDER SUMMARY'!$H$51)","v":""}]
[]
[]
["New Licenses"]
["VMware Products",null,null,"License Fees",null,null,"Maintenance Fees"]
["Product",null,"Product Code","Qty","License Fee","License Total","SnS Term","SnS Fee","SnS Total","SnS Code","Total Cost"]
[{"$f":"'VMware FINAL ORDER SUMMARY'!$F76","v":0},null,{"$f":"'VMware FINAL ORDER SUMMARY'!H76","v":""},{"$f":"'VMware FINAL ORDER SUMMARY'!J76","v":0},{"$f":"'VMware FINAL ORDER SUMMARY'!K76","v":""},{"$f":"'VMware FINAL ORDER SUMMARY'!L76","v":""},{"$f":"'VMware FINAL ORDER SUMMARY'!M76","v":0},{"$f":"'VMware FINAL ORDER SUMMARY'!N76","v":""},{"$f":"'VMware FINAL ORDER SUMMARY'!O76","v":""},{"$f":"'VMware FINAL ORDER SUMMARY'!P76","v":""},{"$f":"'VMware FINAL ORDER SUMMARY'!S76","v":0}]
[{"$f":"'VMware FINAL ORDER SUMMARY'!$F77","v":0},null,{"$f":"'VMware FINAL ORDER SUMMARY'!H77","v":""},{"$f":"'VMware FINAL ORDER SUMMARY'!J77","v":0},{"$f":"'VMware FINAL ORDER SUMMARY'!K77","v":""},{"$f":"'VMware FINAL ORDER SUMMARY'!L77","v":""},{"$f":"'VMware FINAL ORDER SUMMARY'!M77","v":0},{"$f":"'VMware FINAL ORDER SUMMARY'!N77","v":""},{"$f":"'VMware FINAL ORDER SUMMARY'!O77","v":""},{"$f":"'VMware FINAL ORDER SUMMARY'!P77","v":""},{"$f":"'VMware FINAL ORDER SUMMARY'!S77","v":0}]
[{"$f":"'VMware FINAL ORDER SUMMARY'!$F78","v":0},null,{"$f":"'VMware FINAL ORDER SUMMARY'!H78","v":""},{"$f":"'VMware FINAL ORDER SUMMARY'!J78","v":0},{"$f":"'VMware FINAL ORDER SUMMARY'!K78","v":""},{"$f":"'VMware FINAL ORDER SUMMARY'!L78","v":""},{"$f":"'VMware FINAL ORDER SUMMARY'!M78","v":0},{"$f":"'VMware FINAL ORDER SUMMARY'!N78","v":""},{"$f":"'VMware FINAL ORDER SUMMARY'!O78","v":""},{"$f":"'VMware FINAL ORDER SUMMARY'!P78","v":""},{"$f":"'VMware FINAL ORDER SUMMARY'!S78","v":0}]
[{"$f":"'VMware FINAL ORDER SUMMARY'!$F79","v":0},null,{"$f":"'VMware FINAL ORDER SUMMARY'!H79","v":""},{"$f":"'VMware FINAL ORDER SUMMARY'!J79","v":0},{"$f":"'VMware FINAL ORDER SUMMARY'!K79","v":""},{"$f":"'VMware FINAL ORDER SUMMARY'!L79","v":""},{"$f":"'VMware FINAL ORDER SUMMARY'!M79","v":0},{"$f":"'VMware FINAL ORDER SUMMARY'!N79","v":""},{"$f":"'VMware FINAL ORDER SUMMARY'!O79","v":""},{"$f":"'VMware FINAL ORDER SUMMARY'!P79","v":""},{"$f":"'VMware FINAL ORDER SUMMARY'!S79","v":0}]
[{"$f":"'VMware FINAL ORDER SUMMARY'!$F80","v":0},null,{"$f":"'VMware FINAL ORDER SUMMARY'!H80","v":""},{"$f":"'VMware FINAL ORDER SUMMARY'!J80","v":0},{"$f":"'VMware FINAL ORDER SUMMARY'!K80","v":""},{"$f":"'VMware FINAL ORDER SUMMARY'!L80","v":""},{"$f":"'VMware FINAL ORDER SUMMARY'!M80","v":0},{"$f":"'VMware FINAL ORDER SUMMARY'!N80","v":""},{"$f":"'VMware FINAL ORDER SUMMARY'!O80","v":""},{"$f":"'VMware FINAL ORDER SUMMARY'!P80","v":""},{"$f":"'VMware FINAL ORDER SUMMARY'!S80","v":0}]
[{"$f":"'VMware FINAL ORDER SUMMARY'!$F81","v":0},null,{"$f":"'VMware FINAL ORDER SUMMARY'!H81","v":""},{"$f":"'VMware FINAL ORDER SUMMARY'!J81","v":0},{"$f":"'VMware FINAL ORDER SUMMARY'!K81","v":""},{"$f":"'VMware FINAL ORDER SUMMARY'!L81","v":""},{"$f":"'VMware FINAL ORDER SUMMARY'!M81","v":0},{"$f":"'VMware FINAL ORDER SUMMARY'!N81","v":""},{"$f":"'VMware FINAL ORDER SUMMARY'!O81","v":""},{"$f":"'VMware FINAL ORDER SUMMARY'!P81","v":""},{"$f":"'VMware FINAL ORDER SUMMARY'!S81","v":0}]
[{"$f":"'VMware FINAL ORDER SUMMARY'!$F82","v":0},null,{"$f":"'VMware FINAL ORDER SUMMARY'!H82","v":""},{"$f":"'VMware FINAL ORDER SUMMARY'!J82","v":0},{"$f":"'VMware FINAL ORDER SUMMARY'!K82","v":""},{"$f":"'VMware FINAL ORDER SUMMARY'!L82","v":""},{"$f":"'VMware FINAL ORDER SUMMARY'!M82","v":0},{"$f":"'VMware FINAL ORDER SUMMARY'!N82","v":""},{"$f":"'VMware FINAL ORDER SUMMARY'!O82","v":""},{"$f":"'VMware FINAL ORDER SUMMARY'!P82","v":""},{"$f":"'VMware FINAL ORDER SUMMARY'!S82","v":0}]
[{"$f":"'VMware FINAL ORDER SUMMARY'!$F83","v":0},null,{"$f":"'VMware FINAL ORDER SUMMARY'!H83","v":""},{"$f":"'VMware FINAL ORDER SUMMARY'!J83","v":0},{"$f":"'VMware FINAL ORDER SUMMARY'!K83","v":""},{"$f":"'VMware FINAL ORDER SUMMARY'!L83","v":""},{"$f":"'VMware FINAL ORDER SUMMARY'!M83","v":0},{"$f":"'VMware FINAL ORDER SUMMARY'!N83","v":""},{"$f":"'VMware FINAL ORDER SUMMARY'!O83","v":""},{"$f":"'VMware FINAL ORDER SUMMARY'!P83","v":""},{"$f":"'VMware FINAL ORDER SUMMARY'!S83","v":0}]
[{"$f":"'VMware FINAL ORDER SUMMARY'!$F84","v":0},null,{"$f":"'VMware FINAL ORDER SUMMARY'!H84","v":""},{"$f":"'VMware FINAL ORDER SUMMARY'!J84","v":0},{"$f":"'VMware FINAL ORDER SUMMARY'!K84","v":""},{"$f":"'VMware FINAL ORDER SUMMARY'!L84","v":""},{"$f":"'VMware FINAL ORDER SUMMARY'!M84","v":0},{"$f":"'VMware FINAL ORDER SUMMARY'!N84","v":""},{"$f":"'VMware FINAL ORDER SUMMARY'!O84","v":""},{"$f":"'VMware FINAL ORDER SUMMARY'!P84","v":""},{"$f":"'VMware FINAL ORDER SUMMARY'!S84","v":0}]
[{"$f":"'VMware FINAL ORDER SUMMARY'!$F85","v":0},null,{"$f":"'VMware FINAL ORDER SUMMARY'!H85","v":""},{"$f":"'VMware FINAL ORDER SUMMARY'!J85","v":0},{"$f":"'VMware FINAL ORDER SUMMARY'!K85","v":""},{"$f":"'VMware FINAL ORDER SUMMARY'!L85","v":""},{"$f":"'VMware FINAL ORDER SUMMARY'!M85","v":0},{"$f":"'VMware FINAL ORDER SUMMARY'!N85","v":""},{"$f":"'VMware FINAL ORDER SUMMARY'!O85","v":""},{"$f":"'VMware FINAL ORDER SUMMARY'!P85","v":""},{"$f":"'VMware FINAL ORDER SUMMARY'!S85","v":0}]
[]
["Upgrade Licenses:"]
["VMware Products",null,null,"License Fees",null,null,"Maintenance Fees"]
["Product",null,"Product Code","Qty","License Fee","License Total","SnS Term","SnS Fee","SnS Total","SnS Code","Total Cost"]
[{"$f":"'VMware FINAL ORDER SUMMARY'!$F91","v":0},null,{"$f":"'VMware FINAL ORDER SUMMARY'!H91","v":""},{"$f":"'VMware FINAL ORDER SUMMARY'!J91","v":0},{"$f":"'VMware FINAL ORDER SUMMARY'!K91","v":""},{"$f":"'VMware FINAL ORDER SUMMARY'!L91","v":""},{"$f":"'VMware FINAL ORDER SUMMARY'!M91","v":0},{"$f":"'VMware FINAL ORDER SUMMARY'!N91","v":""},{"$f":"'[1]VMware FINAL ORDER SUMMARY'!O70","v":0},{"$f":"'VMware FINAL ORDER SUMMARY'!P91","v":""},{"$f":"'VMware FINAL ORDER SUMMARY'!S91","v":0}]
[{"$f":"'VMware FINAL ORDER SUMMARY'!$F92","v":""},null,null,null,null,null,null,{"$f":"'VMware FINAL ORDER SUMMARY'!O92","v":""},{"$f":"'VMware FINAL ORDER SUMMARY'!O92","v":""},null,{"$f":"'VMware FINAL ORDER SUMMARY'!S92","v":""}]
[{"$f":"'VMware FINAL ORDER SUMMARY'!$F93","v":0},null,{"$f":"'VMware FINAL ORDER SUMMARY'!H93","v":""},{"$f":"'VMware FINAL ORDER SUMMARY'!J93","v":0},{"$f":"'VMware FINAL ORDER SUMMARY'!K93","v":""},{"$f":"'VMware FINAL ORDER SUMMARY'!L93","v":""},{"$f":"'VMware FINAL ORDER SUMMARY'!M93","v":0},{"$f":"'VMware FINAL ORDER SUMMARY'!N93","v":""},{"$f":"'[1]VMware FINAL ORDER SUMMARY'!O72","v":""},{"$f":"'VMware FINAL ORDER SUMMARY'!P93","v":""},{"$f":"'VMware FINAL ORDER SUMMARY'!S93","v":0}]
[{"$f":"'VMware FINAL ORDER SUMMARY'!$F94","v":""},null,null,null,null,null,null,{"$f":"'VMware FINAL ORDER SUMMARY'!N94","v":0},{"$f":"'[1]VMware FINAL ORDER SUMMARY'!O73","v":""},null,{"$f":"'VMware FINAL ORDER SUMMARY'!S94","v":""}]
{"$rows_left_out":29}